Reaction Details
TargetAdenosine receptor A2b
LigandBDBM50258765
Substrate/Competitorn/a
Meas. Tech.ChEMBL_499866 (CHEMBL976198)
Ki 24±n/a nM
Citation Fernández, FCaamaño, OIsabel Nieto, MLópez, CGarcía-Mera, XStefanachi, ANicolotti, OIsabel Loza, MBrea, JEsteve, CSegarra, VVidal, BCarotti, A 1,3-dialkyl-8-N-substituted benzyloxycarbonylamino-9-deazaxanthines as potent adenosine receptor ligands: Design, synthesis, structure-affinity and structure-selectivity relationships. Bioorg Med Chem17:3618-29 (2009) 
 
Adenosine receptor A2b
Name:Adenosine receptor A2b
Type:G Protein-Coupled Receptor (GPCR)
Mol. Mass.:36341.22
Organism:Homo sapiens (Human)
Description:n/a
Residue:332
BDBM50258765
NameBDBM50258765
Synonyms:CHEMBL452454 | [4-(2,3,4,5-Tetrahydro-2,4-dioxo-1,3-dipropyl-1H-pyrrolo[3,2-d]pyrimidin-6-yl)phenyl]methyl 4-(3-chlorophenyl)piperazine-1-carboxylate
TypeSmall organic molecule
Emp. Form.C30H34ClN5O4
Mol. Mass.564.075
SMILESCCCn1c2cc([nH]c2c(=O)n(CCC)c1=O)-c1ccc(COC(=O)N2CCN(CC2)c2cccc(Cl)c2)cc1