Reaction Details
TargetAdenosine receptor A2a
LigandBDBM50258707
Substrate/Competitorn/a
Meas. Tech.ChEMBL_499867 (CHEMBL976199)
Ki 43.7±n/a nM
Citation Fernández, FCaamaño, OIsabel Nieto, MLópez, CGarcía-Mera, XStefanachi, ANicolotti, OIsabel Loza, MBrea, JEsteve, CSegarra, VVidal, BCarotti, A 1,3-dialkyl-8-N-substituted benzyloxycarbonylamino-9-deazaxanthines as potent adenosine receptor ligands: Design, synthesis, structure-affinity and structure-selectivity relationships. Bioorg Med Chem17:3618-29 (2009) 
 
Adenosine receptor A2a
Name:Adenosine receptor A2a
Type:G Protein-Coupled Receptor (GPCR)
Mol. Mass.:44716.46
Organism:Homo sapiens (Human)
Description:P29274
Residue:412
BDBM50258707
NameBDBM50258707
Synonyms:CHEMBL469136 | [4-(2,3,4,5-Tetrahydro-1,3-dimethyl-2,4-dioxo-1H-pyrrolo[3,2-d]pyrimidin-6-yl)phenyl]methyl-3,4-dihydroisoquinoline-2(1H)-carboxylate
TypeSmall organic molecule
Emp. Form.C25H24N4O4
Mol. Mass.444.4825
SMILESCn1c2cc([nH]c2c(=O)n(C)c1=O)-c1ccc(COC(=O)N2CCc3ccccc3C2)cc1