Reaction Details
TargetAdenosine receptor A2a
LigandBDBM50258762
Substrate/Competitorn/a
Meas. Tech.ChEMBL_499867 (CHEMBL976199)
Ki 21.9±n/a nM
Citation Fernández, FCaamaño, OIsabel Nieto, MLópez, CGarcía-Mera, XStefanachi, ANicolotti, OIsabel Loza, MBrea, JEsteve, CSegarra, VVidal, BCarotti, A 1,3-dialkyl-8-N-substituted benzyloxycarbonylamino-9-deazaxanthines as potent adenosine receptor ligands: Design, synthesis, structure-affinity and structure-selectivity relationships. Bioorg Med Chem17:3618-29 (2009) 
 
Adenosine receptor A2a
Name:Adenosine receptor A2a
Type:G Protein-Coupled Receptor (GPCR)
Mol. Mass.:44716.46
Organism:Homo sapiens (Human)
Description:P29274
Residue:412
BDBM50258762
NameBDBM50258762
Synonyms:CHEMBL466035 | [4-(2,3,4,5-Tetrahydro-2,4-dioxo-1,3-dipropyl-1H-pyrrolo[3,2-d]pyrimidin-6-yl)phenyl]methyl isoxazol-3-ylcarbamate
TypeSmall organic molecule
Emp. Form.C23H25N5O5
Mol. Mass.451.4751
SMILESCCCn1c2cc([nH]c2c(=O)n(CCC)c1=O)-c1ccc(COC(=O)Nc2ccon2)cc1