Reaction Details
TargetSolute carrier family 2, facilitated glucose transporter member 1
LigandBDBM50250141
Substrate/Competitorn/a
Meas. Tech.ChEMBL_498540 (CHEMBL973516)
IC50 32850±n/a nM
Citation Gynther, MRopponen, JLaine, KLeppänen, JHaapakoski, PPeura, LJärvinen, TRautio, J Glucose promoiety enables glucose transporter mediated brain uptake of ketoprofen and indomethacin prodrugs in rats. J Med Chem52:3348-53 (2009) 
 
Solute carrier family 2, facilitated glucose transporter member 1
Name:Solute carrier family 2, facilitated glucose transporter member 1
Type:PROTEIN
Mol. Mass.:53969.94
Organism:Rattus norvegicus
Description:ChEMBL_659928
Residue:492
BDBM50250141
NameBDBM50250141
Synonyms:((2R,3S,4S,5R,6R)-3,4,5,6-tetrahydroxytetrahydro-2H-pyran-2-yl)methyl 2-(3-benzoylphenyl)propanoate | CHEMBL494865
TypeSmall organic molecule
Emp. Form.C22H24O8
Mol. Mass.416.4212
SMILESCC(C(=O)OC[C@H]1O[C@@H](O)[C@H](O)[C@@H](O)[C@@H]1O)c1cccc(c1)C(=O)c1ccccc1