Reaction Details
TargetMelanin-concentrating hormone receptor 1
LigandBDBM50258450
Substrate/Competitorn/a
Meas. Tech.ChEMBL_500270 (CHEMBL969605)
IC50 1.30±n/a nM
Citation Suzuki, TMoriya, MSakamoto, TSuga, TKishino, HTakahashi, HIshikawa, MNagai, KImai, YSekino, EIto, MIwaasa, HIshihara, ATokita, SKanatani, ASato, NFukami, T Discovery of novel spiro-piperidine derivatives as highly potent and selective melanin-concentrating hormone 1 receptor antagonists. Bioorg Med Chem Lett19:3072-7 (2009) 
 
Melanin-concentrating hormone receptor 1
Name:Melanin-concentrating hormone receptor 1
Type:G Protein-Coupled Receptor (GPCR)
Mol. Mass.:45976.27
Organism:Homo sapiens (Human)
Description:Membranes from CHO-K1 cells stably expressing human MCH1R were used in assays.
Residue:422
BDBM50258450
NameBDBM50258450
Synonyms:(+/-)-2-(3,4-difluorophenyl)-N-(3-(6-fluoro-1H-spiro[furo[3,4-c]pyridine-3,4'-piperidine]-1'-yl)propyl)-N-methyl-2-(1H-pyrazol-1-yl)acetamide CHEMBL466425
TypeSmall organic molecule
Emp. Form.C26H28F3N5O2
Mol. Mass.499.528
SMILESCN(CCCN1CCC2(CC1)OCc1cc(F)ncc21)C(=O)C(c1ccc(F)c(F)c1)n1cccn1