Reaction Details
TargetOrexin receptor type 2
LigandBDBM50258774
Substrate/Competitorn/a
Meas. Tech.ChEMBL_500316 (CHEMBL973408)
Ki 120±n/a nM
Citation Cox, CDMcGaughey, GBBogusky, MJWhitman, DBBall, RGWinrow, CJRenger, JJColeman, PJ Conformational analysis of N,N-disubstituted-1,4-diazepane orexin receptor antagonists and implications for receptor binding. Bioorg Med Chem Lett19:2997-3001 (2009) 
 
Orexin receptor type 2
Name:Orexin receptor type 2
Type:Protein
Mol. Mass.:50710.53
Organism:Homo sapiens (Human)
Description:O43614
Residue:444
BDBM50258774
NameBDBM50258774
Synonyms:(5-allyl-2-(2H-1,2,3-triazol-2-yl)phenyl)(4-(6-(pent-4-enyl)naphthalen-2-yl)-1,4-diazepan-1-yl)methanone | CHEMBL466260
TypeSmall organic molecule
Emp. Form.C32H35N5O
Mol. Mass.505.6532
SMILESC=CCCCc1ccc2cc(ccc2c1)N1CCCN(CC1)C(=O)c1cc(CC=C)ccc1-n1nccn1