Reaction Details
TargetOrexin receptor type 2
LigandBDBM50258743
Substrate/Competitorn/a
Meas. Tech.ChEMBL_500316 (CHEMBL973408)
Ki 550±n/a nM
Citation Cox, CDMcGaughey, GBBogusky, MJWhitman, DBBall, RGWinrow, CJRenger, JJColeman, PJ Conformational analysis of N,N-disubstituted-1,4-diazepane orexin receptor antagonists and implications for receptor binding. Bioorg Med Chem Lett19:2997-3001 (2009) 
 
Orexin receptor type 2
Name:Orexin receptor type 2
Type:Protein
Mol. Mass.:50710.53
Organism:Homo sapiens (Human)
Description:O43614
Residue:444
BDBM50258743
NameBDBM50258743
Synonyms:CHEMBL511604 | cyclohexyl(4-(quinazolin-2-yl)-1,4-diazepan-1-yl)methanone
TypeSmall organic molecule
Emp. Form.C20H26N4O
Mol. Mass.338.4466
SMILESO=C(C1CCCCC1)N1CCCN(CC1)c1ncc2ccccc2n1