Reaction Details
TargetHistone deacetylase 1
LigandBDBM50238632
Substrate/Competitorn/a
Meas. Tech.ChEMBL_500771 (CHEMBL970550)
IC50 44±n/a nM
Citation Attenni, BOntoria, JMCruz, JCRowley, MSchultz-Fademrecht, CSteinkühler, CJones, P Histone deacetylase inhibitors with a primary amide zinc binding group display antitumor activity in xenograft model. Bioorg Med Chem Lett19:3081-4 (2009) 
 
Histone deacetylase 1
Name:Histone deacetylase 1
Type:Enzyme
Mol. Mass.:55090.27
Organism:Homo sapiens (Human)
Description:Q13547
Residue:482
BDBM50238632
NameBDBM50238632
Synonyms:(6S,9S,12S,14aR)-6-((S)-sec-Butyl)-9-(1-methoxy-1H-indol-3-ylmethyl)-12-(6-oxo-octyl)-decahydro-4a,7,10,13-tetraaza-benzocyclododecene-5,8,11,14-tetraone ChEMBL_275631
TypeSmall organic molecule
Emp. Form.C34H49N5O6
Mol. Mass.623.7828
SMILESCC[C@H](C)[C@@H]1NC(=O)[C@H](Cc2cn(OC)c3ccccc23)NC(=O)[C@H](CCCCCC(=O)CC)NC(=O)[C@H]2CCCCN2C1=O