Reaction Details
TargetHistone deacetylase 1
LigandBDBM50258552
Substrate/Competitorn/a
Meas. Tech.ChEMBL_500771 (CHEMBL970550)
IC50 34±n/a nM
Citation Attenni, BOntoria, JMCruz, JCRowley, MSchultz-Fademrecht, CSteinkühler, CJones, P Histone deacetylase inhibitors with a primary amide zinc binding group display antitumor activity in xenograft model. Bioorg Med Chem Lett19:3081-4 (2009) 
 
Histone deacetylase 1
Name:Histone deacetylase 1
Type:Enzyme
Mol. Mass.:55090.27
Organism:Homo sapiens (Human)
Description:Q13547
Residue:482
BDBM50258552
NameBDBM50258552
Synonyms:(S)-N-methoxy-7-(2-(5-methoxy-2-methyl-1H-indol-3-yl)acetamido)-7-(5-(naphthalen-2-yl)-1H-imidazol-2-yl)heptanamide | CHEMBL453396
TypeSmall organic molecule
Emp. Form.C33H37N5O4
Mol. Mass.567.678
SMILESCONC(=O)CCCCC[C@H](NC(=O)Cc1c(C)[nH]c2ccc(OC)cc12)c1nc(c[nH]1)-c1ccc2ccccc2c1