Reaction Details
TargetCasein kinase II subunit alpha
LigandBDBM11318
Substrate/Competitorn/a
Meas. Tech.ChEMBL_500824 (CHEMBL974405)
IC50 2000±n/a nM
Citation Sekiguchi, YNakaniwa, TKinoshita, TNakanishi, IKitaura, KHirasawa, ATsujimoto, GTada, T Structural insight into human CK2alpha in complex with the potent inhibitor ellagic acid. Bioorg Med Chem Lett19:2920-3 (2009) 
 
Casein kinase II subunit alpha
Name:Casein kinase II subunit alpha
Type:Enzyme
Mol. Mass.:45151.12
Organism:Homo sapiens (Human)
Description:P68400
Residue:391
BDBM11318
NameBDBM11318
Synonyms:1,3,8-trihydroxy-6-methyl-9,10-dihydroanthracene-9,10-dione CHEMBL289277 US20230364057, Compound 242 | med.21724, Compound 24
TypeSmall organic molecule
Emp. Form.C15H10O5
Mol. Mass.270.2369
SMILESCc1cc(O)c2C(=O)c3c(O)cc(O)cc3C(=O)c2c1