Reaction Details
TargetSerine/threonine-protein kinase pim-1
LigandBDBM23408
Substrate/Competitorn/a
Meas. Tech.ChEMBL_500013 (CHEMBL1022925)
IC50 340±n/a nM
Citation Grey, RPierce, ACBemis, GWJacobs, MDMoody, CSJajoo, RMohal, NGreen, J Structure-based design of 3-aryl-6-amino-triazolo[4,3-b]pyridazine inhibitors of Pim-1 kinase. Bioorg Med Chem Lett19:3019-22 (2009) 
 
Serine/threonine-protein kinase pim-1
Name:Serine/threonine-protein kinase pim-1
Type:Protein
Mol. Mass.:35681.82
Organism:Homo sapiens (Human)
Description:P11309
Residue:313
BDBM23408
NameBDBM23408
Synonyms:2-(3,4-dihydroxyphenyl)-3,5,6,7-tetrahydroxy-4H-chromen-4-one Quercetagetin US11759530, Compound Table1.8
Typeflavonol
Emp. Form.C15H10O8
Mol. Mass.318.2351
SMILESOc1ccc(cc1O)-c1oc2cc(O)c(O)c(O)c2c(=O)c1O