Reaction Details
TargetSerine/threonine-protein kinase pim-1
LigandBDBM26626
Substrate/Competitorn/a
Meas. Tech.ChEMBL_500013 (CHEMBL1022925)
IC50 24±n/a nM
Citation Grey, RPierce, ACBemis, GWJacobs, MDMoody, CSJajoo, RMohal, NGreen, J Structure-based design of 3-aryl-6-amino-triazolo[4,3-b]pyridazine inhibitors of Pim-1 kinase. Bioorg Med Chem Lett19:3019-22 (2009) 
 
Serine/threonine-protein kinase pim-1
Name:Serine/threonine-protein kinase pim-1
Type:Protein
Mol. Mass.:35681.82
Organism:Homo sapiens (Human)
Description:P11309
Residue:313
BDBM26626
NameBDBM26626
Synonyms:(5Z)-5-{[3-(trifluoromethyl)phenyl]methylidene}-1,3-thiazolidine-2,4-dione thiazolidine-2,4-dione, 4a
TypeSmall organic molecule
Emp. Form.C11H6F3NO2S
Mol. Mass.273.231
SMILESOC1=NC(=O)C(S1)=Cc1cccc(c1)C(F)(F)F