Reaction Details
TargetSerine/threonine-protein kinase PLK1
LigandBDBM50258287
Substrate/Competitorn/a
Meas. Tech.ChEMBL_500032 (CHEMBL1025480)
Ki>4000±n/a nM
Citation Grey, RPierce, ACBemis, GWJacobs, MDMoody, CSJajoo, RMohal, NGreen, J Structure-based design of 3-aryl-6-amino-triazolo[4,3-b]pyridazine inhibitors of Pim-1 kinase. Bioorg Med Chem Lett19:3019-22 (2009) 
 
Serine/threonine-protein kinase PLK1
Name:Serine/threonine-protein kinase PLK1
Type:Serine/threonine-protein kinase
Mol. Mass.:68277.16
Organism:Homo sapiens (Human)
Description:P53350
Residue:603
BDBM50258287
NameBDBM50258287
Synonyms:CHEMBL493169 | N-(piperidin-4-yl)-3-(3-(trifluoromethyl)phenyl)-[1,2,4]triazolo[4,3-b]pyridazin-6-amine
TypeSmall organic molecule
Emp. Form.C17H17F3N6
Mol. Mass.362.3523
SMILESFC(F)(F)c1cccc(c1)-c1nnc2ccc(NC3CCNCC3)nn12