Reaction Details
TargetVascular endothelial growth factor receptor 2
LigandBDBM50258287
Substrate/Competitorn/a
Meas. Tech.ChEMBL_500026 (CHEMBL1025474)
Ki>4000±n/a nM
Citation Grey, RPierce, ACBemis, GWJacobs, MDMoody, CSJajoo, RMohal, NGreen, J Structure-based design of 3-aryl-6-amino-triazolo[4,3-b]pyridazine inhibitors of Pim-1 kinase. Bioorg Med Chem Lett19:3019-22 (2009) 
 
Vascular endothelial growth factor receptor 2
Name:Vascular endothelial growth factor receptor 2
Type:Receptor Tyrosine Kinase
Mol. Mass.:151510.97
Organism:Homo sapiens (Human)
Description:P35968
Residue:1356
BDBM50258287
NameBDBM50258287
Synonyms:CHEMBL493169 | N-(piperidin-4-yl)-3-(3-(trifluoromethyl)phenyl)-[1,2,4]triazolo[4,3-b]pyridazin-6-amine
TypeSmall organic molecule
Emp. Form.C17H17F3N6
Mol. Mass.362.3523
SMILESFC(F)(F)c1cccc(c1)-c1nnc2ccc(NC3CCNCC3)nn12