Reaction Details
TargetTyrosine-protein kinase ITK/TSK
LigandBDBM50258287
Substrate/Competitorn/a
Meas. Tech.ChEMBL_500022 (CHEMBL1025470)
Ki>4000±n/a nM
Citation Grey, RPierce, ACBemis, GWJacobs, MDMoody, CSJajoo, RMohal, NGreen, J Structure-based design of 3-aryl-6-amino-triazolo[4,3-b]pyridazine inhibitors of Pim-1 kinase. Bioorg Med Chem Lett19:3019-22 (2009) 
 
Tyrosine-protein kinase ITK/TSK
Name:Tyrosine-protein kinase ITK/TSK
Type:Protein
Mol. Mass.:71839.20
Organism:Homo sapiens (Human)
Description:Q08881
Residue:620
BDBM50258287
NameBDBM50258287
Synonyms:CHEMBL493169 | N-(piperidin-4-yl)-3-(3-(trifluoromethyl)phenyl)-[1,2,4]triazolo[4,3-b]pyridazin-6-amine
TypeSmall organic molecule
Emp. Form.C17H17F3N6
Mol. Mass.362.3523
SMILESFC(F)(F)c1cccc(c1)-c1nnc2ccc(NC3CCNCC3)nn12