Reaction Details
TargetSerine/threonine-protein kinase pim-1
LigandBDBM50258327
Substrate/Competitorn/a
Meas. Tech.ChEMBL_500013 (CHEMBL1022925)
Ki 160±n/a nM
Citation Grey, RPierce, ACBemis, GWJacobs, MDMoody, CSJajoo, RMohal, NGreen, J Structure-based design of 3-aryl-6-amino-triazolo[4,3-b]pyridazine inhibitors of Pim-1 kinase. Bioorg Med Chem Lett19:3019-22 (2009) 
 
Serine/threonine-protein kinase pim-1
Name:Serine/threonine-protein kinase pim-1
Type:Protein
Mol. Mass.:35681.82
Organism:Homo sapiens (Human)
Description:P11309
Residue:313
BDBM50258327
NameBDBM50258327
Synonyms:CHEMBL493561 | N-(1-methylpiperidin-4-yl)-3-(3-(trifluoromethyl)phenyl)-[1,2,4]triazolo[4,3-b]pyridazin-6-amine
TypeSmall organic molecule
Emp. Form.C18H19F3N6
Mol. Mass.376.3789
SMILESCN1CCC(CC1)Nc1ccc2nnc(-c3cccc(c3)C(F)(F)F)n2n1