Reaction Details
TargetSerine/threonine-protein kinase pim-1
LigandBDBM50258858
Substrate/Competitorn/a
Meas. Tech.ChEMBL_500013 (CHEMBL1022925)
Ki 50±n/a nM
Citation Grey, RPierce, ACBemis, GWJacobs, MDMoody, CSJajoo, RMohal, NGreen, J Structure-based design of 3-aryl-6-amino-triazolo[4,3-b]pyridazine inhibitors of Pim-1 kinase. Bioorg Med Chem Lett19:3019-22 (2009) 
 
Serine/threonine-protein kinase pim-1
Name:Serine/threonine-protein kinase pim-1
Type:Protein
Mol. Mass.:35681.82
Organism:Homo sapiens (Human)
Description:P11309
Residue:313
BDBM50258858
NameBDBM50258858
Synonyms:CHEMBL450568 | N-(cyclopropylmethyl)-3-(3-(trifluoromethyl)phenyl)-[1,2,4]triazolo[4,3-b]pyridazin-6-amine
TypeSmall organic molecule
Emp. Form.C16H14F3N5
Mol. Mass.333.3111
SMILESFC(F)(F)c1cccc(c1)-c1nnc2ccc(NCC3CC3)nn12