Reaction Details
TargetAlpha-2A adrenergic receptor
LigandBDBM50258561
Substrate/Competitorn/a
Meas. Tech.ChEMBL_500050 (CHEMBL970453)
Ki 1020±n/a nM
Citation Roberts, LRFish, PVIan Storer, RWhitlock, GA 6,7-Dihydro-5H-pyrrolo[1,2-a] imidazoles as potent and selective alpha1A adrenoceptor partial agonists. Bioorg Med Chem Lett19:3113-7 (2009) 
 
Alpha-2A adrenergic receptor
Name:Alpha-2A adrenergic receptor
Type:Enzyme
Mol. Mass.:48979.91
Organism:Homo sapiens (Human)
Description:P08913
Residue:450
BDBM50258561
NameBDBM50258561
Synonyms:(R)-2-(2-(6,7-dihydro-5H-pyrrolo[1,2-a]imidazol-6-yl)phenyl)oxazole | CHEMBL448147
TypeSmall organic molecule
Emp. Form.C15H13N3O
Mol. Mass.251.2832
SMILESC1[C@@H](Cn2ccnc12)c1ccccc1-c1ncco1