Reaction Details
TargetAlpha-2A adrenergic receptor
LigandBDBM50258592
Substrate/Competitorn/a
Meas. Tech.ChEMBL_500050 (CHEMBL970453)
Ki 202±n/a nM
Citation Roberts, LRFish, PVIan Storer, RWhitlock, GA 6,7-Dihydro-5H-pyrrolo[1,2-a] imidazoles as potent and selective alpha1A adrenoceptor partial agonists. Bioorg Med Chem Lett19:3113-7 (2009) 
 
Alpha-2A adrenergic receptor
Name:Alpha-2A adrenergic receptor
Type:Enzyme
Mol. Mass.:48979.91
Organism:Homo sapiens (Human)
Description:P08913
Residue:450
BDBM50258592
NameBDBM50258592
Synonyms:(S)-2'-(6,7-dihydro-5H-pyrrolo[1,2-a]imidazol-6-yl)-N-methylbiphenyl-3-carboxamide | CHEMBL466012
TypeSmall organic molecule
Emp. Form.C20H19N3O
Mol. Mass.317.3844
SMILESCNC(=O)c1cccc(c1)-c1ccccc1[C@@H]1Cc2nccn2C1