Reaction Details
Target5-hydroxytryptamine receptor 3A
LigandBDBM50258339
Substrate/Competitorn/a
Meas. Tech.ChEMBL_523350 (CHEMBL1006686)
Ki 2.2±n/a nM
Citation Morelli, EGemma, SBudriesi, RCampiani, GNovellino, EFattorusso, CCatalanotti, BCoccone, SSRos, SBorrelli, GPersico, MFiorini, INacci, VIoan, PChiarini, AHamon, MCagnotto, AMennini, TFracasso, CColovic, MCaccia, SButini, S Specific targeting of peripheral serotonin 5-HT(3) receptors. Synthesis, biological investigation, and structure-activity relationships. J Med Chem52:3548-62 (2009) 
 
5-hydroxytryptamine receptor 3A
Name:5-hydroxytryptamine receptor 3A
Type:Enzyme Catalytic Domain
Mol. Mass.:55428.70
Organism:RAT
Description:5-HT3 HTR3A RAT::P35563
Residue:483
BDBM50258339
NameBDBM50258339
Synonyms:CHEMBL492395 | [4-(7-Fluoropyrrolo[1,2-a]quinoxalin-4-yl)piperazin-1-yl]hydroxyacetamide
TypeSmall organic molecule
Emp. Form.C17H18FN5O2
Mol. Mass.343.3555
SMILESONC(=O)CN1CCN(CC1)c1nc2cc(F)ccc2n2cccc12