Reaction Details
TargetAndrogen receptor
LigandBDBM50258751
Substrate/Competitorn/a
Meas. Tech.ChEMBL_523646 (CHEMBL998017)
Ki 1.1±n/a nM
Citation Mohler, MLBohl, CEJones, ACoss, CCNarayanan, RHe, YHwang, DJDalton, JTMiller, DD Nonsteroidal selective androgen receptor modulators (SARMs): dissociating the anabolic and androgenic activities of the androgen receptor for therapeutic benefit. J Med Chem52:3597-617 (2009) 
 
Androgen receptor
Name:Androgen receptor
Type:Receptor
Mol. Mass.:99185.27
Organism:Homo sapiens (Human)
Description:CHO cells were stably transfected with human AR gene.
Residue:920
BDBM50258751
NameBDBM50258751
Synonyms:(R)-2-(5,6-dichloro-1H-benzo[d]imidazol-2-yl)-1,1,1-trifluorobut-3-en-2-ol JNJ-37654032
TypeSmall organic molecule
Emp. Form.C11H7Cl2F3N2O
Mol. Mass.311.087
SMILESO[C@](C=C)(c1nc2cc(Cl)c(Cl)cc2[nH]1)C(F)(F)F