Reaction Details
TargetCarbonic anhydrase
LigandBDBM10873
Substrate/Competitorn/a
Meas. Tech.ChEMBL_519732 (CHEMBL938995)
Ki 33±n/a nM
Citation Güzel, OMaresca, AScozzafava, ASalman, ABalaban, ATSupuran, CT Discovery of low nanomolar and subnanomolar inhibitors of the mycobacterial beta-carbonic anhydrases Rv1284 and Rv3273. J Med Chem52:4063-7 (2009) 
 
Carbonic anhydrase
Name:Carbonic anhydrase
Synonyms:PROBABLE TRANSMEMBRANE CARBONIC ANHYDRASE (CARBONATE DEHYDRATASE) (CARBONIC DEHYDRATASE)
Type:PROTEIN
Mol. Mass.:80567.22
Organism:Mycobacterium tuberculosis
Description:ChEMBL_878775
Residue:764
BDBM10873
NameBDBM10873
TypeSmall organic molecule
Emp. Form.C10H11N5O2S
Mol. Mass.265.292
SMILESNc1nccc(Nc2ccc(cc2)S(N)(=O)=O)n1