Reaction Details
TargetCarbonic anhydrase 1
LigandBDBM50258299
Substrate/Competitorn/a
Meas. Tech.ChEMBL_519734 (CHEMBL938997)
Ki 0.93±n/a nM
Citation Güzel, OMaresca, AScozzafava, ASalman, ABalaban, ATSupuran, CT Discovery of low nanomolar and subnanomolar inhibitors of the mycobacterial beta-carbonic anhydrases Rv1284 and Rv3273. J Med Chem52:4063-7 (2009) 
 
Carbonic anhydrase 1
Name:Carbonic anhydrase 1
Type:Enzyme
Mol. Mass.:28873.37
Organism:Homo sapiens (Human)
Description:P00915
Residue:261
BDBM50258299
NameBDBM50258299
Synonyms:1-({[5-(Aminosulfonyl)-3-(2,3,4,5,6-pentafluorophenyl)-1H-indol-2-yl]carbonyl}amino)-2,4,6 trimethylpyridinium perchlorate CHEMBL501294
TypeSmall organic molecule
Emp. Form.C23H18F5N4O3S
Mol. Mass.525.47
SMILESCc1cc(C)[n+](NC(=O)c2[nH]c3ccc(cc3c2-c2c(F)c(F)c(F)c(F)c2F)S(N)(=O)=O)c(C)c1