Reaction Details
TargetCarbonic anhydrase
LigandBDBM50258299
Substrate/Competitorn/a
Meas. Tech.ChEMBL_519732 (CHEMBL938995)
Ki 0.93±n/a nM
Citation Güzel, OMaresca, AScozzafava, ASalman, ABalaban, ATSupuran, CT Discovery of low nanomolar and subnanomolar inhibitors of the mycobacterial beta-carbonic anhydrases Rv1284 and Rv3273. J Med Chem52:4063-7 (2009) 
 
Carbonic anhydrase
Name:Carbonic anhydrase
Synonyms:PROBABLE TRANSMEMBRANE CARBONIC ANHYDRASE (CARBONATE DEHYDRATASE) (CARBONIC DEHYDRATASE)
Type:PROTEIN
Mol. Mass.:80567.22
Organism:Mycobacterium tuberculosis
Description:ChEMBL_878775
Residue:764
BDBM50258299
NameBDBM50258299
TypeSmall organic molecule
Emp. Form.C23H18F5N4O3S
Mol. Mass.525.47
SMILESCc1cc(C)[n+](NC(=O)c2[nH]c3ccc(cc3c2-c2c(F)c(F)c(F)c(F)c2F)S(N)(=O)=O)c(C)c1