Reaction Details
TargetBeta-carbonic anhydrase 1
LigandBDBM50258298
Substrate/Competitorn/a
Meas. Tech.ChEMBL_519733 (CHEMBL938996)
Ki 8.6±n/a nM
Citation Güzel, OMaresca, AScozzafava, ASalman, ABalaban, ATSupuran, CT Discovery of low nanomolar and subnanomolar inhibitors of the mycobacterial beta-carbonic anhydrases Rv1284 and Rv3273. J Med Chem52:4063-7 (2009) 
 
Beta-carbonic anhydrase 1
Name:Beta-carbonic anhydrase 1
Type:Enzyme
Mol. Mass.:18186.06
Organism:Mycobacterium tuberculosis
Description:The recombinant GST-mtCA1 construct was cloned, expressed, and further purified from E. coli. The purified protein was used in inhibition assays.
Residue:163
BDBM50258298
NameBDBM50258298
Synonyms:1-(3-(3-methoxyphenyl)-5-sulfamoyl-1H-indole-2-carboxamido)-2,4,6-trimethylpyridinium perchlorate CHEMBL521690
TypeSmall organic molecule
Emp. Form.C24H25N4O4S
Mol. Mass.465.544
SMILESCOc1cccc(c1)-c1c([nH]c2ccc(cc12)S(N)(=O)=O)C(=O)N[n+]1c(C)cc(C)cc1C