Reaction Details
TargetCarbonic anhydrase 1
LigandBDBM50258716
Substrate/Competitorn/a
Meas. Tech.ChEMBL_519734 (CHEMBL938997)
Ki 0.97±n/a nM
Citation Güzel, OMaresca, AScozzafava, ASalman, ABalaban, ATSupuran, CT Discovery of low nanomolar and subnanomolar inhibitors of the mycobacterial beta-carbonic anhydrases Rv1284 and Rv3273. J Med Chem52:4063-7 (2009) 
 
Carbonic anhydrase 1
Name:Carbonic anhydrase 1
Type:Enzyme
Mol. Mass.:28873.37
Organism:Homo sapiens (Human)
Description:P00915
Residue:261
BDBM50258716
NameBDBM50258716
Synonyms:1-({[5-(Aminosulfonyl)-3-(4-bromophenyl)-1H-indol-2-yl]carbonyl}amino)-2,4,6 trimethylpyridinium perchlorate CHEMBL468946
TypeSmall organic molecule
Emp. Form.C24H25N4O3S
Mol. Mass.449.545
SMILESCc1ccc(cc1)-c1c([nH]c2ccc(cc12)S(N)(=O)=O)C(=O)N[n+]1c(C)cc(C)cc1C