Reaction Details
TargetBeta-carbonic anhydrase 1
LigandBDBM50258714
Substrate/Competitorn/a
Meas. Tech.ChEMBL_519733 (CHEMBL938996)
Ki 10.5±n/a nM
Citation Güzel, OMaresca, AScozzafava, ASalman, ABalaban, ATSupuran, CT Discovery of low nanomolar and subnanomolar inhibitors of the mycobacterial beta-carbonic anhydrases Rv1284 and Rv3273. J Med Chem52:4063-7 (2009) 
 
Beta-carbonic anhydrase 1
Name:Beta-carbonic anhydrase 1
Type:Enzyme
Mol. Mass.:18186.06
Organism:Mycobacterium tuberculosis
Description:The recombinant GST-mtCA1 construct was cloned, expressed, and further purified from E. coli. The purified protein was used in inhibition assays.
Residue:163
BDBM50258714
NameBDBM50258714
Synonyms:1-({[5-(Aminosulfonyl)-3-(2-bromophenyl)-1H-indol-2-yl]carbonyl}amino)-2,4,6 trimethylpyridinium perchlorate CHEMBL466234
TypeSmall organic molecule
Emp. Form.C24H25N4O3S
Mol. Mass.449.545
SMILESCc1cc(C)[n+](NC(=O)c2[nH]c3ccc(cc3c2-c2ccccc2C)S(N)(=O)=O)c(C)c1