Reaction Details
TargetBeta-carbonic anhydrase 1
LigandBDBM50258680
Substrate/Competitorn/a
Meas. Tech.ChEMBL_519733 (CHEMBL938996)
Ki 30.8±n/a nM
Citation Güzel, OMaresca, AScozzafava, ASalman, ABalaban, ATSupuran, CT Discovery of low nanomolar and subnanomolar inhibitors of the mycobacterial beta-carbonic anhydrases Rv1284 and Rv3273. J Med Chem52:4063-7 (2009) 
 
Beta-carbonic anhydrase 1
Name:Beta-carbonic anhydrase 1
Type:Enzyme
Mol. Mass.:18186.06
Organism:Mycobacterium tuberculosis
Description:The recombinant GST-mtCA1 construct was cloned, expressed, and further purified from E. coli. The purified protein was used in inhibition assays.
Residue:163
BDBM50258680
NameBDBM50258680
Synonyms:1-(3-(3-bromophenyl)-5-sulfamoyl-1H-indole-2-carboxamido)-2,4,6-trimethylpyridinium perchlorate CHEMBL467898
TypeSmall organic molecule
Emp. Form.C23H22BrN4O3S
Mol. Mass.514.414
SMILESCc1cc(C)[n+](NC(=O)c2[nH]c3ccc(cc3c2-c2cccc(Br)c2)S(N)(=O)=O)c(C)c1