Reaction Details
TargetCarbonic anhydrase 2
LigandBDBM50258678
Substrate/Competitorn/a
Meas. Tech.ChEMBL_519735 (CHEMBL938998)
Ki 0.96±n/a nM
Citation Güzel, OMaresca, AScozzafava, ASalman, ABalaban, ATSupuran, CT Discovery of low nanomolar and subnanomolar inhibitors of the mycobacterial beta-carbonic anhydrases Rv1284 and Rv3273. J Med Chem52:4063-7 (2009) 
 
Carbonic anhydrase 2
Name:Carbonic anhydrase 2
Type:Enzyme
Mol. Mass.:29250.71
Organism:Homo sapiens (Human)
Description:P00918
Residue:260
BDBM50258678
NameBDBM50258678
Synonyms:1-(3-(4-chlorophenyl)-5-sulfamoyl-1H-indole-2-carboxamido)-2,4,6-trimethylpyridinium perchlorate CHEMBL513854
TypeSmall organic molecule
Emp. Form.C23H22ClN4O3S
Mol. Mass.469.963
SMILESCc1cc(C)[n+](NC(=O)c2[nH]c3ccc(cc3c2-c2ccc(Cl)cc2)S(N)(=O)=O)c(C)c1