Reaction Details
TargetCarbonic anhydrase 2
LigandBDBM50258636
Substrate/Competitorn/a
Meas. Tech.ChEMBL_519735 (CHEMBL938998)
Ki 6.7±n/a nM
Citation Güzel, OMaresca, AScozzafava, ASalman, ABalaban, ATSupuran, CT Discovery of low nanomolar and subnanomolar inhibitors of the mycobacterial beta-carbonic anhydrases Rv1284 and Rv3273. J Med Chem52:4063-7 (2009) 
 
Carbonic anhydrase 2
Name:Carbonic anhydrase 2
Type:Enzyme
Mol. Mass.:29250.71
Organism:Homo sapiens (Human)
Description:P00918
Residue:260
BDBM50258636
NameBDBM50258636
Synonyms:1-(3-(2-chlorophenyl)-5-sulfamoyl-1H-indole-2-carboxamido)-2,4,6-trimethylpyridinium perchlorate CHEMBL513835
TypeSmall organic molecule
Emp. Form.C23H22ClN4O3S
Mol. Mass.469.963
SMILESCc1cc(C)[n+](NC(=O)c2[nH]c3ccc(cc3c2-c2ccccc2Cl)S(N)(=O)=O)c(C)c1