Reaction Details
TargetCarbonic anhydrase
LigandBDBM50258587
Substrate/Competitorn/a
Meas. Tech.ChEMBL_519732 (CHEMBL938995)
Ki 71±n/a nM
Citation Güzel, OMaresca, AScozzafava, ASalman, ABalaban, ATSupuran, CT Discovery of low nanomolar and subnanomolar inhibitors of the mycobacterial beta-carbonic anhydrases Rv1284 and Rv3273. J Med Chem52:4063-7 (2009) 
 
Carbonic anhydrase
Name:Carbonic anhydrase
Synonyms:PROBABLE TRANSMEMBRANE CARBONIC ANHYDRASE (CARBONATE DEHYDRATASE) (CARBONIC DEHYDRATASE)
Type:PROTEIN
Mol. Mass.:80567.22
Organism:Mycobacterium tuberculosis
Description:ChEMBL_878775
Residue:764
BDBM50258587
NameBDBM50258587
TypeSmall organic molecule
Emp. Form.C23H23N4O3S
Mol. Mass.435.518
SMILESCc1cc(C)[n+](NC(=O)c2[nH]c3ccc(cc3c2-c2ccccc2)S(N)(=O)=O)c(C)c1