Reaction Details
TargetIntegrin alpha-4
LigandBDBM50258530
Substrate/Competitorn/a
Meas. Tech.ChEMBL_522801 (CHEMBL999754)
IC50 0.110000±n/a nM
Citation Lin, LSLanza, TJewell, JPLiu, PJones, CKieczykowski, GRTreonze, KSi, QManior, SKoo, GTong, XWang, JSchuelke, APivnichny, JWang, RRaab, CVincent, SDavies, PMaccoss, MMumford, RAHagmann, WK Discovery of N-{N-[(3-cyanophenyl)sulfonyl]-4(R)-cyclobutylamino-(L)-prolyl}-4-[(3',5'-dichloroisonicotinoyl) amino]-(L)-phenylalanine (MK-0668), an extremely potent and orally active antagonist of very late antigen-4. J Med Chem52:3449-52 (2009) 
 
Integrin alpha-4
Name:Integrin alpha-4
Type:Membrane Protein
Mol. Mass.:114897.35
Organism:Homo sapiens (Human)
Description:P13612
Residue:1032
BDBM50258530
NameBDBM50258530
Synonyms:(S)-3-(4-(3,5-dichloroisonicotinamido)phenyl)-2-((S)-1-(3,5-dichlorophenylsulfonyl)-2-methylpyrrolidine-2-carboxamido)propanoic acid | CHEMBL506449
TypeSmall organic molecule
Emp. Form.C27H24Cl4N4O6S
Mol. Mass.674.38
SMILESC[C@]1(CCCN1S(=O)(=O)c1cc(Cl)cc(Cl)c1)C(=O)N[C@@H](Cc1ccc(NC(=O)c2c(Cl)cncc2Cl)cc1)C(O)=O