Reaction Details
TargetHistone deacetylase 1
LigandBDBM50258539
Substrate/Competitorn/a
Meas. Tech.ChEMBL_522840 (CHEMBL1002508)
IC50 11±n/a nM
Citation Kinzel, OLlauger-Bufi, LPescatore, GRowley, MSchultz-Fademrecht, CMonteagudo, EFonsi, MGonzalez Paz, OFiore, FSteinkühler, CJones, P Discovery of a potent class I selective ketone histone deacetylase inhibitor with antitumor activity in vivo and optimized pharmacokinetic properties. J Med Chem52:3453-6 (2009) 
 
Histone deacetylase 1
Name:Histone deacetylase 1
Type:Enzyme
Mol. Mass.:55090.27
Organism:Homo sapiens (Human)
Description:Q13547
Residue:482
BDBM50258539
NameBDBM50258539
Synonyms:(S)-1-methyl-N-(1-(5-(naphthalen-2-yl)-1H-imidazol-2-yl)-7-oxooctyl)piperidine-4-carboxamide | CHEMBL468513
TypeSmall organic molecule
Emp. Form.C28H36N4O2
Mol. Mass.460.611
SMILESCN1CCC(CC1)C(=O)N[C@@H](CCCCCC(C)=O)c1nc(c[nH]1)-c1ccc2ccccc2c1