Reaction Details
TargetHistone deacetylase 3
LigandBDBM19410
Substrate/Competitorn/a
Meas. Tech.ChEMBL_522847 (CHEMBL1002515)
IC50 400±n/a nM
Citation Kinzel, OLlauger-Bufi, LPescatore, GRowley, MSchultz-Fademrecht, CMonteagudo, EFonsi, MGonzalez Paz, OFiore, FSteinkühler, CJones, P Discovery of a potent class I selective ketone histone deacetylase inhibitor with antitumor activity in vivo and optimized pharmacokinetic properties. J Med Chem52:3453-6 (2009) 
 
Histone deacetylase 3
Name:Histone deacetylase 3
Type:Enzyme
Mol. Mass.:48829.55
Organism:Homo sapiens (Human)
Description:O15379
Residue:428
BDBM19410
NameBDBM19410
Synonyms:CHEMBL27759 US11377423, MS-275 US9265734, MS-275 benzamide-type inhibitor, 3 | pyridin-3-ylmethyl N-({4-[(2-aminophenyl)carbamoyl]phenyl}methyl)carbamate
TypeSmall organic molecule
Emp. Form.C21H20N4O3
Mol. Mass.376.4085
SMILESNc1ccccc1NC(=O)c1ccc(CNC(=O)OCc2cccnc2)cc1