Reaction Details
TargetMetabotropic glutamate receptor 5
LigandBDBM50149805
Substrate/Competitorn/a
Meas. Tech.ChEMBL_523078 (CHEMBL1004108)
Ki 5.7±n/a nM
Citation Kulkarni, SSZou, MFCao, JDeschamps, JRRodriguez, ALConn, PJNewman, AH Structure-activity relationships comparing N-(6-methylpyridin-yl)-substituted aryl amides to 2-methyl-6-(substituted-arylethynyl)pyridines or 2-methyl-4-(substituted-arylethynyl)thiazoles as novel metabotropic glutamate receptor subtype 5 antagonists. J Med Chem52:3563-75 (2009) 
 
Metabotropic glutamate receptor 5
Name:Metabotropic glutamate receptor 5
Type:Enzyme
Mol. Mass.:132484.72
Organism:Homo sapiens (Human)
Description:n/a
Residue:1212
BDBM50149805
NameBDBM50149805
Synonyms:2-(Pyridin-3-yl)-5-(2-methylthiazol-4ylethynyl)pyridine CHEMBL369310
TypeSmall organic molecule
Emp. Form.C16H11N3S
Mol. Mass.277.344
SMILESCc1nc(cs1)C#Cc1ccc(nc1)-c1cccnc1