Reaction Details
TargetMetabotropic glutamate receptor 5
LigandBDBM50258665
Substrate/Competitorn/a
Meas. Tech.ChEMBL_523078 (CHEMBL1004108)
Ki 9.8±n/a nM
Citation Kulkarni, SSZou, MFCao, JDeschamps, JRRodriguez, ALConn, PJNewman, AH Structure-activity relationships comparing N-(6-methylpyridin-yl)-substituted aryl amides to 2-methyl-6-(substituted-arylethynyl)pyridines or 2-methyl-4-(substituted-arylethynyl)thiazoles as novel metabotropic glutamate receptor subtype 5 antagonists. J Med Chem52:3563-75 (2009) 
 
Metabotropic glutamate receptor 5
Name:Metabotropic glutamate receptor 5
Type:Enzyme
Mol. Mass.:132484.72
Organism:Homo sapiens (Human)
Description:n/a
Residue:1212
BDBM50258665
NameBDBM50258665
Synonyms:3-Cyano-4-phenyl-N-(6-methylpyridin-2-yl)-benzamide | CHEMBL466006
TypeSmall organic molecule
Emp. Form.C20H15N3O
Mol. Mass.313.3526
SMILESCc1cccc(NC(=O)c2ccc(-c3ccccc3)c(c2)C#N)n1