Reaction Details
TargetProtein kinase C theta type
LigandBDBM29816
Substrate/Competitorn/a
Meas. Tech.ChEMBL_523117 (CHEMBL1007475)
IC50 13±n/a nM
Citation Boschelli, DHWang, DPrashad, ASSubrath, JWu, BNiu, CLee, JYang, XBrennan, AChaudhary, D Optimization of 5-phenyl-3-pyridinecarbonitriles as PKCtheta inhibitors. Bioorg Med Chem Lett19:3623-6 (2009) 
 
Protein kinase C theta type
Name:Protein kinase C theta type
Type:Serine/threonine-protein kinase
Mol. Mass.:81878.04
Organism:Homo sapiens (Human)
Description:Full-length human PKC theta (Panvera Catalog No. P2996).
Residue:706
BDBM29816
NameBDBM29816
Synonyms:4-indolylamino-5-phenyl-3-pyridinecarbonitrile, 1c | CHEMBL513485
TypeSmall organic molecule
Emp. Form.C22H18N4O2
Mol. Mass.370.4039
SMILESCOc1ccc(cc1OC)-c1cncc(C#N)c1Nc1cccc2[nH]ccc12