Reaction Details
TargetProtein kinase C theta type
LigandBDBM50258385
Substrate/Competitorn/a
Meas. Tech.ChEMBL_523117 (CHEMBL1007475)
IC50 55±n/a nM
Citation Boschelli, DHWang, DPrashad, ASSubrath, JWu, BNiu, CLee, JYang, XBrennan, AChaudhary, D Optimization of 5-phenyl-3-pyridinecarbonitriles as PKCtheta inhibitors. Bioorg Med Chem Lett19:3623-6 (2009) 
 
Protein kinase C theta type
Name:Protein kinase C theta type
Type:Serine/threonine-protein kinase
Mol. Mass.:81878.04
Organism:Homo sapiens (Human)
Description:Full-length human PKC theta (Panvera Catalog No. P2996).
Residue:706
BDBM50258385
NameBDBM50258385
Synonyms:5-(3,4-dimethoxyphenyl)-4-(4-ethyl-1H-indol-5-ylamino)nicotinonitrile | CHEMBL494000
TypeSmall organic molecule
Emp. Form.C24H22N4O2
Mol. Mass.398.4571
SMILESCCc1c(Nc2c(cncc2-c2ccc(OC)c(OC)c2)C#N)ccc2[nH]ccc12