Reaction Details
TargetProtein kinase C theta type
LigandBDBM50258819
Substrate/Competitorn/a
Meas. Tech.ChEMBL_523117 (CHEMBL1007475)
IC50 36±n/a nM
Citation Boschelli, DHWang, DPrashad, ASSubrath, JWu, BNiu, CLee, JYang, XBrennan, AChaudhary, D Optimization of 5-phenyl-3-pyridinecarbonitriles as PKCtheta inhibitors. Bioorg Med Chem Lett19:3623-6 (2009) 
 
Protein kinase C theta type
Name:Protein kinase C theta type
Type:Serine/threonine-protein kinase
Mol. Mass.:81878.04
Organism:Homo sapiens (Human)
Description:Full-length human PKC theta (Panvera Catalog No. P2996).
Residue:706
BDBM50258819
NameBDBM50258819
Synonyms:5-(3-methoxyphenyl)-4-(4-methyl-1H-indol-5-ylamino)nicotinonitrile | CHEMBL513827
TypeSmall organic molecule
Emp. Form.C22H18N4O
Mol. Mass.354.4045
SMILESCOc1cccc(c1)-c1cncc(C#N)c1Nc1ccc2[nH]ccc2c1C