Reaction Details
TargetProtein kinase C theta type
LigandBDBM50258344
Substrate/Competitorn/a
Meas. Tech.ChEMBL_523117 (CHEMBL1007475)
IC50 4.5±n/a nM
Citation Boschelli, DHWang, DPrashad, ASSubrath, JWu, BNiu, CLee, JYang, XBrennan, AChaudhary, D Optimization of 5-phenyl-3-pyridinecarbonitriles as PKCtheta inhibitors. Bioorg Med Chem Lett19:3623-6 (2009) 
 
Protein kinase C theta type
Name:Protein kinase C theta type
Type:Serine/threonine-protein kinase
Mol. Mass.:81878.04
Organism:Homo sapiens (Human)
Description:Full-length human PKC theta (Panvera Catalog No. P2996).
Residue:706
BDBM50258344
NameBDBM50258344
Synonyms:4-(4-methyl-1H-indol-5-ylamino)-5-(4-(2-(pyrrolidin-1-yl)ethoxy)phenyl)nicotinonitrile | CHEMBL494412
TypeSmall organic molecule
Emp. Form.C27H27N5O
Mol. Mass.437.5362
SMILESCc1c(Nc2c(cncc2-c2ccc(OCCN3CCCC3)cc2)C#N)ccc2[nH]ccc12