Reaction Details
TargetProtein kinase C delta type
LigandBDBM50258344
Substrate/Competitorn/a
Meas. Tech.ChEMBL_523118 (CHEMBL1007476)
IC50 28±n/a nM
Citation Boschelli, DHWang, DPrashad, ASSubrath, JWu, BNiu, CLee, JYang, XBrennan, AChaudhary, D Optimization of 5-phenyl-3-pyridinecarbonitriles as PKCtheta inhibitors. Bioorg Med Chem Lett19:3623-6 (2009) 
 
Protein kinase C delta type
Name:Protein kinase C delta type
Type:Enzyme
Mol. Mass.:77516.79
Organism:Homo sapiens (Human)
Description:The recombinant human PKC enzymes were produced using a baculovirus expression system in SF9 cells
Residue:676
BDBM50258344
NameBDBM50258344
Synonyms:4-(4-methyl-1H-indol-5-ylamino)-5-(4-(2-(pyrrolidin-1-yl)ethoxy)phenyl)nicotinonitrile | CHEMBL494412
TypeSmall organic molecule
Emp. Form.C27H27N5O
Mol. Mass.437.5362
SMILESCc1c(Nc2c(cncc2-c2ccc(OCCN3CCCC3)cc2)C#N)ccc2[nH]ccc12