Reaction Details
TargetReceptor tyrosine-protein kinase erbB-2
LigandBDBM50268999
Substrate/Competitorn/a
Meas. Tech.ChEMBL_523761 (CHEMBL1008369)
IC50 99±n/a nM
Citation Burns, DMLi, YLShi, EHe, CXu, MZhuo, JZhang, CQian, DQLi, YWynn, RCovington, MBKatiyar, KMarando, CAFridman, JSScherle, PFriedman, SMetcalf, BYao, W Compelling P1 substituent affect on metalloprotease binding profile enables the design of a novel cyclohexyl core scaffold with excellent MMP selectivity and HER-2 sheddase inhibition. Bioorg Med Chem Lett19:3525-30 (2009) 
 
Receptor tyrosine-protein kinase erbB-2
Name:Receptor tyrosine-protein kinase erbB-2
Type:n/a
Mol. Mass.:137894.47
Organism:Homo sapiens (Human)
Description:P04626
Residue:1255
BDBM50268999
NameBDBM50268999
Synonyms:(1S,2S,5RS)-N-hydroxy-5-(2-oxo-2-(pyrrolidin-1-yl)ethyl)-2-(4-phenylpiperazine-1-carbonyl)cyclohexanecarboxamide | CHEMBL523076
TypeSmall organic molecule
Emp. Form.C24H34N4O4
Mol. Mass.442.5512
SMILESONC(=O)[C@H]1CC(CC(=O)N2CCCC2)CC[C@@H]1C(=O)N1CCN(CC1)c1ccccc1