Reaction Details
TargetReceptor tyrosine-protein kinase erbB-2
LigandBDBM50269001
Substrate/Competitorn/a
Meas. Tech.ChEMBL_523761 (CHEMBL1008369)
IC50 100±n/a nM
Citation Burns, DMLi, YLShi, EHe, CXu, MZhuo, JZhang, CQian, DQLi, YWynn, RCovington, MBKatiyar, KMarando, CAFridman, JSScherle, PFriedman, SMetcalf, BYao, W Compelling P1 substituent affect on metalloprotease binding profile enables the design of a novel cyclohexyl core scaffold with excellent MMP selectivity and HER-2 sheddase inhibition. Bioorg Med Chem Lett19:3525-30 (2009) 
 
Receptor tyrosine-protein kinase erbB-2
Name:Receptor tyrosine-protein kinase erbB-2
Type:n/a
Mol. Mass.:137894.47
Organism:Homo sapiens (Human)
Description:P04626
Residue:1255
BDBM50269001
NameBDBM50269001
Synonyms:(1S,2S,5RS)-N-hydroxy-5-(2-(4-methylpiperazin-1-yl)-2-oxoethyl)-2-(4-phenylpiperazine-1-carbonyl)cyclohexanecarboxamide | CHEMBL497222
TypeSmall organic molecule
Emp. Form.C25H37N5O4
Mol. Mass.471.5924
SMILESCN1CCN(CC1)C(=O)CC1CC[C@@H]([C@H](C1)C(=O)NO)C(=O)N1CCN(CC1)c1ccccc1