Reaction Details
TargetReceptor tyrosine-protein kinase erbB-2
LigandBDBM50269057
Substrate/Competitorn/a
Meas. Tech.ChEMBL_523761 (CHEMBL1008369)
IC50 18±n/a nM
Citation Burns, DMLi, YLShi, EHe, CXu, MZhuo, JZhang, CQian, DQLi, YWynn, RCovington, MBKatiyar, KMarando, CAFridman, JSScherle, PFriedman, SMetcalf, BYao, W Compelling P1 substituent affect on metalloprotease binding profile enables the design of a novel cyclohexyl core scaffold with excellent MMP selectivity and HER-2 sheddase inhibition. Bioorg Med Chem Lett19:3525-30 (2009) 
 
Receptor tyrosine-protein kinase erbB-2
Name:Receptor tyrosine-protein kinase erbB-2
Type:n/a
Mol. Mass.:137894.47
Organism:Homo sapiens (Human)
Description:P04626
Residue:1255
BDBM50269057
NameBDBM50269057
Synonyms:(1S,2S,5S)-N-hydroxy-5-(2-oxo-2-(piperidin-1-yl)ethyl)-2-(4-phenylpiperazine-1-carbonyl)cyclohexanecarboxamide | CHEMBL496628
TypeSmall organic molecule
Emp. Form.C25H36N4O4
Mol. Mass.456.5777
SMILESONC(=O)[C@H]1C[C@@H](CC(=O)N2CCCCC2)CC[C@@H]1C(=O)N1CCN(CC1)c1ccccc1