Reaction Details
TargetReceptor tyrosine-protein kinase erbB-2
LigandBDBM50269059
Substrate/Competitorn/a
Meas. Tech.ChEMBL_523761 (CHEMBL1008369)
IC50 67±n/a nM
Citation Burns, DMLi, YLShi, EHe, CXu, MZhuo, JZhang, CQian, DQLi, YWynn, RCovington, MBKatiyar, KMarando, CAFridman, JSScherle, PFriedman, SMetcalf, BYao, W Compelling P1 substituent affect on metalloprotease binding profile enables the design of a novel cyclohexyl core scaffold with excellent MMP selectivity and HER-2 sheddase inhibition. Bioorg Med Chem Lett19:3525-30 (2009) 
 
Receptor tyrosine-protein kinase erbB-2
Name:Receptor tyrosine-protein kinase erbB-2
Type:n/a
Mol. Mass.:137894.47
Organism:Homo sapiens (Human)
Description:P04626
Residue:1255
BDBM50269059
NameBDBM50269059
Synonyms:(1S,2S,5S)-N-hydroxy-2-(4-(3-isopropylphenyl)piperidine-1-carbonyl)-5-(2-oxo-2-(piperidin-1-yl)ethyl)cyclohexanecarboxamide | CHEMBL496829
TypeSmall organic molecule
Emp. Form.C29H43N3O4
Mol. Mass.497.6694
SMILESCC(C)c1cccc(c1)C1CCN(CC1)C(=O)[C@H]1CC[C@H](CC(=O)N2CCCCC2)C[C@@H]1C(=O)NO