Reaction Details
TargetNeuropeptide Y receptor type 5
LigandBDBM50249737
Substrate/Competitorn/a
Meas. Tech.ChEMBL_498773 (CHEMBL1021965)
Ki 2±n/a nM
Citation Sato, NAndo, MIshikawa, SJitsuoka, MNagai, KTakahashi, HSakuraba, ATsuge, HKitazawa, HIwaasa, HMashiko, SGomori, AMoriya, RFujino, NOhe, TIshihara, AKanatani, AFukami, T Discovery of tetrasubstituted imidazolines as potent and selective neuropeptide Y Y5 receptor antagonists: reduced human ether-a-go-go related gene potassium channel binding affinity and potent antiobesity effect. J Med Chem52:3385-96 (2009) 
 
Neuropeptide Y receptor type 5
Name:Neuropeptide Y receptor type 5
Type:Enzyme
Mol. Mass.:50746.64
Organism:Homo sapiens (Human)
Description:Q15761
Residue:445
BDBM50249737
NameBDBM50249737
Synonyms:2-(4,4-bis(4-fluorophenyl)-4,5-dihydro-1H-imidazol-2-yl)isonicotinonitrile | CHEMBL522456
TypeSmall organic molecule
Emp. Form.C21H14F2N4
Mol. Mass.360.3595
SMILESFc1ccc(cc1)C1(CNC(=N1)c1cc(ccn1)C#N)c1ccc(F)cc1