Reaction Details
TargetNeuropeptide Y receptor type 5
LigandBDBM50249739
Substrate/Competitorn/a
Meas. Tech.ChEMBL_498773 (CHEMBL1021965)
Ki 1±n/a nM
Citation Sato, NAndo, MIshikawa, SJitsuoka, MNagai, KTakahashi, HSakuraba, ATsuge, HKitazawa, HIwaasa, HMashiko, SGomori, AMoriya, RFujino, NOhe, TIshihara, AKanatani, AFukami, T Discovery of tetrasubstituted imidazolines as potent and selective neuropeptide Y Y5 receptor antagonists: reduced human ether-a-go-go related gene potassium channel binding affinity and potent antiobesity effect. J Med Chem52:3385-96 (2009) 
 
Neuropeptide Y receptor type 5
Name:Neuropeptide Y receptor type 5
Type:Enzyme
Mol. Mass.:50746.64
Organism:Homo sapiens (Human)
Description:Q15761
Residue:445
BDBM50249739
NameBDBM50249739
Synonyms:2-[(5S)-4,4-Bis(4-fluorophenyl)-5-methyl-4,5-dihydro-1H-imidazol-2-yl]-4-pyridinecarbonitrile | CHEMBL523134
TypeSmall organic molecule
Emp. Form.C22H16F2N4
Mol. Mass.374.386
SMILESC[C@@H]1NC(=NC1(c1ccc(F)cc1)c1ccc(F)cc1)c1cc(ccn1)C#N