Reaction Details
TargetNeuropeptide Y receptor type 5
LigandBDBM50249833
Substrate/Competitorn/a
Meas. Tech.ChEMBL_498773 (CHEMBL1021965)
Ki 1.4±n/a nM
Citation Sato, NAndo, MIshikawa, SJitsuoka, MNagai, KTakahashi, HSakuraba, ATsuge, HKitazawa, HIwaasa, HMashiko, SGomori, AMoriya, RFujino, NOhe, TIshihara, AKanatani, AFukami, T Discovery of tetrasubstituted imidazolines as potent and selective neuropeptide Y Y5 receptor antagonists: reduced human ether-a-go-go related gene potassium channel binding affinity and potent antiobesity effect. J Med Chem52:3385-96 (2009) 
 
Neuropeptide Y receptor type 5
Name:Neuropeptide Y receptor type 5
Type:Enzyme
Mol. Mass.:50746.64
Organism:Homo sapiens (Human)
Description:Q15761
Residue:445
BDBM50249833
NameBDBM50249833
Synonyms:6-[(4S,5S)-4-(4-Fluorophenyl)-4-(6-fluoro-3-pyridyl)-5-methyl-4,5-dihydro-1H-imidazol-2-yl]-2(1H)-pyridinone | CHEMBL489726
TypeSmall organic molecule
Emp. Form.C20H16F2N4O
Mol. Mass.366.364
SMILESC[C@@H]1NC(=N[C@@]1(c1ccc(F)cc1)c1ccc(F)nc1)c1cccc(=O)[nH]1