Reaction Details
TargetDynamin-1
LigandBDBM50268295
Substrate/Competitorn/a
Meas. Tech.ChEMBL_523163 (CHEMBL997155)
IC50 5000±n/a nM
Citation Hill, TAGordon, CPMcGeachie, ABVenn-Brown, BOdell, LRChau, NQuan, AMariana, ASakoff, JAChircop, MRobinson, PJMcCluskey, A Inhibition of dynamin mediated endocytosis by the dynoles--synthesis and functional activity of a family of indoles. J Med Chem52:3762-73 (2009) 
 
Dynamin-1
Name:Dynamin-1
Type:PROTEIN
Mol. Mass.:97411.67
Organism:Homo sapiens (Human)
Description:ChEMBL_1458576
Residue:864
BDBM50268295
NameBDBM50268295
Synonyms:2-Cyano-N-octyl-3-(1-(3-dimethylaminopropyl)-1H-indol-3-yl)-acrylamide | CHEMBL483059
TypeSmall organic molecule
Emp. Form.C25H36N4O
Mol. Mass.408.5795
SMILESCCCCCCCCNC(=O)C(=C\c1cn(CCCN(C)C)c2ccccc12)\C#N