Reaction Details
TargetNeuropeptide Y receptor type 5
LigandBDBM50268739
Substrate/Competitorn/a
Meas. Tech.ChEMBL_523817 (CHEMBL1008329)
IC50 0.69±n/a nM
Citation Takahashi, THaga, YSakamoto, TMoriya, MOkamoto, ONonoshita, KShibata, TSuga, TTakahashi, HHirohashi, TSakuraba, AGomori, AIwaasa, HOhe, TIshihara, AIshii, YKanatani, AFukami, T Aryl urea derivatives of spiropiperidines as NPY Y5 receptor antagonists. Bioorg Med Chem Lett19:3511-6 (2009) 
 
Neuropeptide Y receptor type 5
Name:Neuropeptide Y receptor type 5
Type:Enzyme
Mol. Mass.:50746.64
Organism:Homo sapiens (Human)
Description:Q15761
Residue:445
BDBM50268739
NameBDBM50268739
Synonyms:CHEMBL524085 | N-(3-(4-chlorophenyl)isoxazol-5-yl)-3-oxo-3H-spiro[isobenzofuran-1,4'-piperidine]-1'-carboxamide
TypeSmall organic molecule
Emp. Form.C22H18ClN3O4
Mol. Mass.423.849
SMILESClc1ccc(cc1)-c1cc(NC(=O)N2CCC3(CC2)OC(=O)c2ccccc32)on1